{"text_format":"1","workbook":"xlsx","n_sheets":6,"sheets":["Main Page","Decision Making","Input sheet","Budget Summary","Norms and Assumptions","Dropdown"],"not_rendered":{"charts":0,"images":2,"macros":1,"external_links":0,"defined_names":2,"comments":0,"pivot_tables":0},"unopened":[],"bounds":{"document_bytes":16777216,"sheet_cells":100000,"rows_first":2000,"rows_last":500,"rows_between":2000,"halvings":0,"cell_chars":16384,"cell_head_chars":4096},"cells_cut":0,"cells_raw":0,"read":"whole","date_system":"1900"}

{"sheet":"Main Page","index":0,"n_rows":28,"n_cols":4,"rows_kept":28,"cut":false,"hidden":false,"merged":[[27,2,27,5],[0,1,0,5],[6,1,6,5],[21,2,21,5],[25,2,25,5],[17,2,17,5],[19,2,19,5],[20,2,20,5],[26,2,26,5],[18,2,18,5],[22,3,22,5],[21,1,24,1]]}
[null,"Tool for gap assessment of\nequipments and vehicles for \nSolid Waste Management in Urban Local Bodies"]
[]
[]
[]
[]
[]
[null,"Objectives of this tool are to:\n1. Carry out  a gap assessment of the equipments and vehicles required for Solid waste management\n2. Estimate the number of vehicles and equipments to be procured for ensuring 100% coverage of waste management services in the ULB\n\nLimitation of this tool:\n1. It does not calculate construction cost for any infrastructure establishment like treatment plant, transfer station etc."]
[]
[]
[]
[]
[]
[]
[]
[]
[]
[]
[null,"Sr.No.","NOTES"]
[null,1,"Please fill the sheets in the following order-"]
[null,"i)","Decision Making"]
[null,"ii)","Input Sheet"]
[null,2,"The cells which are white in color are the cells which need to be filled by the city. Different cell colors indicate different meaning which is mentioned below:"]
[null,null,"Light Orange","Value generated automatically"]
[null,null,"Blue","Questions"]
[null,null,"White","Data to be filled"]
[null,3,"Some of the tables have been accompanied with notes on the side. Please go through the notes before filling in the details."]
[null,4,"In case the ULB does not have vehicles and equipment listed in existing situation section in the Input Sheet, insert zero (0), do not leave the cell blank."]
[null,5,"Placement of community bins is to be decided by the ULB"]

{"sheet":"Decision Making","index":1,"n_rows":5,"n_cols":5,"rows_kept":5,"cut":false,"hidden":false,"merged":[[0,1,0,3],[3,4,3,10]]}
[null,"As this excel workbook is a tool to find out requirements of vehicles and equipment for SWM, before moving ahead, some decisions have to be taken for accurate estimation, which are mentioned below:"]
[]
[null,1,"Proposed average number of trips per day of each vehicle used for Door to Door waste collection (Considering distance of waste disposal site from the ULB)",3]
[null,2,"Proposed average number of trips of each vehicle per day for collecting waste from bulk generators",2,"Bulk generators means waste generated from vegetable, meat, fruit & flower markets and kitchen of hotels and restaurants. It is recommended that if the ULB has composting plant then the waste generated from bulk generators should be collected separately and should be disposed directly to the plant."]
[null,3,"Beat length of road for street sweeping in meters",600]

{"sheet":"Input sheet","index":2,"n_rows":336,"n_cols":10,"rows_kept":336,"cut":false,"hidden":false,"merged":[[32,3,32,4],[55,1,55,2],[56,1,56,2],[57,1,57,2],[59,1,59,4],[51,0,51,2],[40,3,40,4],[46,1,46,4],[47,1,47,2],[48,1,48,2],[49,1,49,2],[50,1,50,2],[52,1,52,4],[53,1,53,2],[58,1,58,2],[54,1,54,2],[36,3,37,4],[60,1,60,2],[117,8,117,9],[66,1,66,4],[67,1,67,2],[87,4,89,5],[91,1,91,3],[44,0,44,4],[128,5,129,5],[53,5,65,6],[77,0,77,1],[85,0,85,1],[115,8,116,9],[61,1,61,2],[128,7,129,7],[101,6,103,6],[101,7,103,7],[71,0,71,3],[115,1,116,1],[128,6,129,6],[111,0,111,7],[68,1,68,2],[63,1,63,2],[69,1,69,2],[70,1,70,2],[10,0,10,2],[15,0,15,2],[128,3,128,4],[112,0,113,0],[92,1,92,2],[98,1,98,2],[99,1,99,2],[97,0,97,2],[93,0,93,2],[87,1,87,2],[94,1,94,2],[95,1,95,2],[102,2,103,2],[112,1,113,1],[62,1,62,2],[96,1,96,2],[74,0,74,3],[73,1,73,3],[88,1,88,2],[89,1,89,2],[101,3,102,4],[104,0,104,7],[101,5,103,5],[64,1,64,2],[72,1,72,3],[69,5,69,7],[70,5,70,7],[65,0,65,3],[68,5,68,6],[128,1,129,2],[118,0,118,7],[115,0,116,0],[128,0,129,0],[76,1,76,2],[260,2,261,2],[253,0,253,2],[265,0,265,2],[276,0,276,2],[104,8,104,9],[101,8,103,9],[102,1,103,1],[101,1,101,2],[101,0,103,0],[131,1,131,2],[130,1,130,2],[153,7,154,7],[151,1,151,2],[147,1,147,2],[149,1,149,2],[157,1,157,2],[158,1,158,2],[155,1,155,2],[142,1,142,2],[144,3,145,3],[156,1,156,2],[146,1,146,2],[134,0,135,0],[171,1,171,3],[334,1,334,2],[281,1,281,2],[290,0,290,2],[258,1,258,5],[219,1,219,2],[252,1,252,2],[335,1,335,2],[270,1,270,3],[244,0,245,0],[244,1,245,1],[284,1,284,2],[282,1,282,2],[283,1,283,2],[271,1,271,2],[273,1,273,2],[332,1,332,2],[333,1,333,2],[295,1,295,4],[272,1,272,2],[262,0,262,2],[264,1,264,2],[275,1,275,2],[286,1,286,2],[289,1,289,2],[167,1,167,2],[183,4,183,8],[153,0,154,0],[144,0,145,0],[165,1,165,2],[173,1,173,2],[160,1,160,2],[161,1,161,2],[162,1,162,2],[164,1,164,2],[172,1,172,2],[148,1,148,2],[153,1,153,2],[154,1,154,2],[144,1,145,2],[169,1,169,2],[159,1,159,2],[144,4,145,4],[183,1,183,3],[166,1,166,2],[132,1,132,2],[136,1,136,2],[137,1,137,2],[138,1,138,2],[134,3,135,3],[141,1,141,2],[153,3,153,6],[134,4,135,4],[140,1,140,2],[134,1,135,2],[150,1,150,2],[139,1,139,2],[244,5,245,5],[203,1,203,3],[244,2,245,2],[244,4,245,4],[241,1,241,2],[244,3,245,3],[242,1,242,2],[243,1,243,2],[206,1,206,3],[204,1,204,3],[239,1,239,2],[238,1,238,3],[227,3,230,4],[225,1,225,2],[211,1,211,2],[210,1,210,3],[208,1,208,3],[196,1,196,3],[240,1,240,2],[198,1,198,3],[199,1,199,3],[200,1,200,3],[202,1,202,3],[220,0,220,2],[130,8,130,10],[176,0,176,8],[185,9,185,10],[191,1,191,3],[187,1,187,3],[194,1,194,3],[195,1,195,3],[189,1,189,3],[184,3,185,3],[183,9,184,10],[184,4,184,8],[184,1,185,1],[184,2,185,2],[168,1,168,2],[178,0,178,2],[182,0,182,8],[184,0,185,0]]}
[]
[]
[]
[]
[]
[]
[]
[]
[]
[]
["A. CITY PROFILE"]
[]
[]
[]
[]
["General Information"]
[1,"Name of the ULB"]
[2,"Name of the head of the ULB"]
[3,"Area of the ULB in sq.km."]
[4,"Inhabited Area (sq.km.)"]
[5,"Number of Election Wards"]
[6,"Total Population of the ULB (Census 2001)"]
[7,"Total Population of the ULB (Census 2011)"]
[8,"Total Number of Households (Census 2011)"]
[9,"Household Size (Census 2011)",{"$f":"IFERROR(C23/C24, 0)","v":0}]
[10,"Decadal Growth Rate of City Population (1981-1991)"]
[11,"Decadal Growth Rate of City Population (1991-2001)"]
[12,"Decadal Growth Rate of City Population (2001-2011)",{"$f":"IFERROR((C23-C22)/C22,0)","v":0}]
[13,"Yearly Growth Rate of  City Population",{"$f":"IFERROR(C28/10,0)","v":0}]
[14,"Total Population of the ULB (Current year)\n(As per latest survey conducted after census 2011 or based on the populaion projection)"]
[15,"Total Number of Households (Current Year)"]
[16,"Households in peri-urban areas"]
[17,"Number of Slum Settlements/Pockets\n(As per latest slum survey conducted after census 2011, SFCPoA etc.)",null,"Mention all slums as per list with ULB, use any latest surveys done under affordable housing mission/PMAY"]
[18,"Number of Slum Households\n(As per latest slum survey conducted after census 2011, SFCPoA etc.)"]
[19,"Slum Population\n(As per latest slum survey conducted after census 2011, SFCPoA etc.)"]
[20,"Total Number of Properties (Current Year)",{"$f":"C37+C38","v":0}]
[20.100000000000001,"Number of Residential Properties (Current Year)",null,"Number of residential and non-residential poperties registered with the ULB can be taken from property tax software"]
[20.2,"Number of Non-Residential (Commercial) Properties (2017)"]
[21,"Approx. area covered under Urban Village (Gamtal) in sq.km. (old city area where road width is less than 3m)"]
[22,"Approx. Number of Households in Urban Village (Gamtal)"]
[23,"Total Length of Road in kms (Both Kutcha and Pucca)",null,"Include the length of highways in case present in city limits"]
[23.1,"Total Length of Roads with Divider in kms"]
[23.2,"Approx. Length of Roads less than 3m width (kms)"]
[]
["B. Existing Scenario of Solid Waste"]
[]
["S.No.","WASTE GENERATION"]
[1,"Residential Generators",null,"Number","Estimated waste Generation (TPD)"]
[1.1000000000000001,"Households in Slum areas",null,{"$f":"'Input sheet'!C34","v":0}]
[1.2,"Households in Urban Village (Gamtal)",null,{"$f":"'Input sheet'!C40","v":0}]
[1.3,"Households in the Areas Other than slums and Urban Village (Gamtal)",null,{"$f":"'Input sheet'!C31-'Input sheet'!D49-'Input sheet'!D50","v":0}]
["Total Waste generated from Residential Generators",null,null,{"$f":"SUM(D49:D51)","v":0},{"$f":"SUM(E49:E51)","v":0}]
[2,"Bulk waste Generators"]
[2.1,"Kitchens of Hotels, Restaurants, mess and canteen of hostels",null,{"$f":"SUM(D55:D58)","v":0},{"$f":"SUM(E55:E58)","v":0},"Estimate the number of hotels (which has boarding and lodging Facilities) and Restaurants in the ULB and then estimate the approximate quantity of waste generated from these properties.\n\nNumber of hotels can be taken from license registered with the ULB (or may be it called trade license data)\n\nThis is only applicable to small bulk generators as it is assumed that large bulk generators will manage their waste in a decentralized manner"]
["2.1.1","Hotels"]
["2.1.2","Restaurants"]
["2.1.3","Mess/ Canteen of Hostels and Institutes"]
["2.1.4","Marriage Halls/ Party plots"]
[2.2000000000000002,"Religious Places (Temple, Gurudwara, Mosque etc.)"]
[2.2999999999999998,"Markets:"]
{"$rows_left_out":277}
{"sheet":"Budget Summary","index":3,"n_rows":178,"n_cols":6,"rows_kept":178,"cut":false,"hidden":false,"merged":[[177,0,177,1],[175,0,175,1],[127,0,127,4],[152,0,152,4],[126,0,126,4],[150,0,150,1],[148,0,148,1],[82,0,82,1],[84,1,84,5],[0,0,0,5],[53,0,53,1],[45,1,45,5],[57,1,57,5],[72,0,72,1],[44,0,44,5],[73,0,73,1],[74,0,74,1],[54,0,54,1],[55,0,55,1],[81,0,81,1],[80,0,80,1],[76,1,76,5],[123,0,123,1],[109,0,109,1],[118,0,118,1],[87,0,87,1],[88,0,88,1],[90,1,90,5],[96,1,96,5],[101,0,101,1],[93,0,93,1],[94,0,94,1]]}
["Summary of Budget"]
[]
[]
[]
[]
[]
[]
[null,"Demographic Profile of the ULB","Details"]
[null,{"$f":"'Input sheet'!B17","v":"Name of the ULB"},{"$f":"IF('Input sheet'!C17=\"\",\"\",'Input sheet'!C17)","v":""}]
[null,{"$f":"'Input sheet'!B19","v":"Area of the ULB in sq.km."},{"$f":"IF('Input sheet'!C19=\"\",\"\",'Input sheet'!C19)","v":""}]
[null,{"$f":"'Input sheet'!B21","v":"Number of Election Wards"},{"$f":"IF('Input sheet'!C21=\"\",\"\",'Input sheet'!C21)","v":""}]
[null,{"$f":"'Input sheet'!B30","v":"Total Population of the ULB (Current year)\n(As per latest survey conducted after census 2011 or based on the populaion projection)"},{"$f":"IF('Input sheet'!C30=\"\",\"\",'Input sheet'!C30)","v":""}]
[null,{"$f":"'Input sheet'!B31","v":"Total Number of Households (Current Year)"},{"$f":"IF('Input sheet'!C31=\"\",\"\",'Input sheet'!C31)","v":""}]
[null,{"$f":"'Input sheet'!B33","v":"Number of Slum Settlements/Pockets\n(As per latest slum survey conducted after census 2011, SFCPoA etc.)"},{"$f":"IF('Input sheet'!C33=\"\",\"\",'Input sheet'!C33)","v":""}]
[null,{"$f":"'Input sheet'!B35","v":"Slum Population\n(As per latest slum survey conducted after census 2011, SFCPoA etc.)"},{"$f":"IF('Input sheet'!C35=\"\",\"\",'Input sheet'!C35)","v":""}]
[null,{"$f":"'Input sheet'!B34","v":"Number of Slum Households\n(As per latest slum survey conducted after census 2011, SFCPoA etc.)"},{"$f":"IF('Input sheet'!C34=\"\",\"\",'Input sheet'!C34)","v":""}]
[null,"Total Watse Generation in TPD (Current year)",{"$f":"IF('Input sheet'!E75=\"\",\"\",'Input sheet'!E75)","v":0}]
[]
[null,"Total Capital Cost","Cost in Rs."]
[null,"2017-18",{"$f":"D54+D73+D81+D87+D93+D102+D110+D119+D122","v":0}]
[null,"2018-19",{"$f":"E54+E73+E81+E87+E93+E102+E110+E119","v":0}]
[null,"2019-20",{"$f":"F54+F73+F81+F87+F93+F102+F110+F119","v":0}]
[null,"Total",{"$f":"SUM(C20:C22)","v":0}]
[]
[null,"Total Operation and Maintenance Cost","Cost in Rs."]
[null,"2017-18",{"$f":"C149+C176","v":0}]
[null,"2018-19",{"$f":"D149+D176","v":0}]
[null,"2019-20",{"$f":"E149+E176","v":0}]
[null,"Total",{"$f":"SUM(C26:C28)","v":0}]
[]
[null,"Break-up of Capex based on percentage of vehicles that ULB wants to be procured by the Private Agency","ULB Share","Private Agency Share"]
[null,"D2D collection from residential and commercial areas",{"$f":"D56","v":0},{"$f":"D55","v":0}]
[null,"Secondary waste collection",{"$f":"D75","v":0},{"$f":"D74","v":0}]
[null,"Waste collection from bulk generators",{"$f":"D83","v":0},{"$f":"D82","v":0}]
[null,"C&D waste collection",{"$f":"D89","v":0},{"$f":"D88","v":0}]
[null,"Carcass waste collection",{"$f":"D95","v":0},{"$f":"D94","v":0}]
[null,"Procurement of other vehicles",{"$f":"SUM(D102:F102)","v":0},"-"]
[null,"Equipments of street sweeping",{"$f":"SUM(D110:F110)","v":0},"-"]
[null,"Health safety gears",{"$f":"SUM(D119:F119)","v":0},"-"]
[null,"Household dustbins for source segregation",{"$f":"D122","v":0},"-"]
[null,"Total Cost",{"$f":"SUM(C32:C40)","v":0},{"$f":"SUM(D32:D40)","v":0}]
[]
[null,"Total amount required for procurement of Vehicles/Equipments and its O&M",{"$f":"C23+C29","v":0}]
[]
["Details of CAPEX for Procurement of Equipments and Vehicles"]
[1,"Requirement of vehicles for D2D collection from Residential and Commercial Areas"]
["Sr. No.","Name of Equipment","Net Requirement of Equipments for 2017-18","Capex for Year 2017-18\n(Amount in Rs.)","Capex for Year 2018-19\n(Amount in Rs.)","Capex for Year 2019-20\n(Amount in Rs.)"]
[1.1000000000000001,{"$f":"'Input sheet'!B298","v":"Hand Cart with 6 Bins for only D2D collection from Residential and Commercial areas"},{"$f":"'Input sheet'!E298","v":0},{"$f":"IF(C48=0,0,(C48*'Norms and Assumptions'!$M$2))","v":0},0,0]
[1.2,{"$f":"'Input sheet'!B300","v":"Tricycle with bins"},{"$f":"'Input sheet'!E300","v":0},{"$f":"IF(C49=0,0,(C49*'Norms and Assumptions'!M3))","v":0},0,0]
[1.3,{"$f":"'Input sheet'!B301","v":"3-wheeler auto with tipping hopper"},{"$f":"'Input sheet'!E301","v":0},{"$f":"IF(C50=0,0,(C50*'Norms and Assumptions'!M4))","v":0},0,0]
[1.4,{"$f":"'Input sheet'!B302","v":"Mini tipper (4 wheel Mini Truck Container Mounted)"},{"$f":"'Input sheet'!E302","v":0},{"$f":"IF(C51=0,0,(C51*'Norms and Assumptions'!M5))","v":0},0,0]
[1.5,{"$f":"'Input sheet'!B304","v":"Tractor with trolley"},{"$f":"'Input sheet'!E304","v":0},{"$f":"IF(C52=0,0,(C52*'Norms and Assumptions'!M7))","v":0},0,0]
[1.6,"Mini Compactor",{"$f":"'Input sheet'!E307","v":0},{"$f":"IF(C53=0,0,(C53*'Norms and Assumptions'!M10))","v":0},0,0]
["Total",null,{"$f":"SUM(C48:C53)","v":0},{"$f":"SUM(D48:D53)","v":0},{"$f":"SUM(E48:E53)","v":0},0]
["Private Agency Share",null,{"$f":"'Input sheet'!C222","v":0},{"$f":"SUM($D$54:$F$54)*C55","v":0}]
["ULB Share",null,{"$f":"'Input sheet'!C223","v":0},{"$f":"SUM(D54:F54)-D55","v":0}]
[]
[2,"Requirement of vehicles/equipments for secondary waste collection"]
["Sr. No.","Name of Equipment","Net Requirement of Equipment for 2017-18","Capex for Year 2017-18\n(Amount in Rs.)","Capex for Year 2018-19\n(Amount in Rs.)","Capex for Year 2019-20\n(Amount in Rs.)"]
[2.1,{"$f":"'Input sheet'!B299","v":"Hand Cart with 6 Bins for only street sweeping"},{"$f":"'Input sheet'!E299","v":0},{"$f":"IF(C60=0,0,(C60*'Norms and Assumptions'!$M$2))","v":0},0,0]
{"$rows_left_out":119}
{"sheet":"Norms and Assumptions","index":4,"n_rows":104,"n_cols":16,"rows_kept":104,"cut":false,"hidden":true,"merged":[[97,0,97,1],[94,0,94,1],[90,0,90,1],[0,1,0,2],[19,0,19,1],[82,0,82,1],[89,0,89,1]]}
["Type of equipments/vehicles","Norms",null,"Capacity in KG","Capacity in MT","Source","Average life of equipment in years",null,null,null,null,"Name of Equipment","Unit Rate\n(Amount in Rs.)","Maintenance","Driver","Helper"]
["Hand Cart with 6 Bins",{"$f":"ROUNDUP(D2/$B$18,-1)","v":30},"HHs",60,{"$f":"D2/1000","v":0.06},"Table 2.3, SBM MSWM maual part 2",3,null,{"$f":"D2/B18","v":26.666666666666668},null,null,{"$f":"'Budget Summary'!B130","v":"Hand Cart with 6 Bins"},6800,0.1,1,0]
["Tricycle with bins",{"$f":"ROUNDUP(D3/$B$18,-1)","v":40},"HHs",80,{"$f":"D3/1000","v":0.08},"Table 2.3, SBM MSWM maual part 2",3,null,{"$f":"D3/B18","v":35.555555555555557},null,null,{"$f":"'Budget Summary'!B49","v":"Tricycle with bins"},25000,0.1,1,0]
["3-wheeler auto with tipping hopper",160,"HHs",350,0.35,"KUIDFC",5,null,{"$f":"D4/$B$18","v":155.55555555555554},null,null,{"$f":"'Budget Summary'!B50","v":"3-wheeler auto with tipping hopper"},325000,0.15,1,1]
["Mini Tipper (4 wheel Mini Truck Container Mounted)",450,"HHs",1000,1,"As per ULBs of Gujarat",5,null,{"$f":"D5/$B$18","v":444.44444444444446},null,null,{"$f":"'Budget Summary'!B51","v":"Mini tipper (4 wheel Mini Truck Container Mounted)"},800000,0.2,1,1]
["Mini Tipper (Closed Body to collect hotel and restaurant kitchen waste)",null,null,1500,1.5,null,5,null,null,null,null,{"$f":"'Budget Summary'!B79","v":"Mini tipper (Closed Body to collect hotel and restaurant kitchen waste)"},1400000,0.2,1,1]
["Tempo Truck",null,null,4000,4,null,null,null,null,null,null,{"$f":"'Budget Summary'!B52","v":"Tractor with trolley"},{"$f":"450000+165000","v":615000},0.1,1,2]
["Trolley (Trailor)",450,"HHs",1000,1,"As per ULBs of Gujarat","3-5",null,{"$f":"D8/$B$18","v":444.44444444444446},null,null,{"$f":"'Budget Summary'!B80","v":"Tempo Truck"},1200000,0.2,1,2]
["Galvanized Trolley 660 L",null,null,300,0.3,null,null,null,null,null,null,{"$f":"'Budget Summary'!B87","v":"Open Body Truck with crane arm for C&D waste"},3400000,0.2,1,1]
["Galvanized Trolley 1100 L",null,null,500,0.5,null,null,null,null,null,null,{"$f":"'Budget Summary'!B63","v":"Mini Compactor for secondary waste collection"},1650000,0.2,1,2]
["Community Bins (Containers - Green and Black)",null,null,null,0,null,null,null,null,null,null,{"$f":"'Budget Summary'!B64","v":"Refuse Compactor"},2800000,0.2,1,2]
["Open Body Truck with Crane Arm",null,null,5000,5,null,null,null,null,null,null,{"$f":"'Budget Summary'!B93","v":"Automated dead animal lifting vehicle"},3000000,0.2,1,2]
["Mini Compactors",null,null,5000,5,null,null,null,null,null,null,{"$f":"'Budget Summary'!B65","v":"Front End Loader (JCB)"},2400000,0.2,1,1]
["Refuse Compactors",null,null,10000,10,null,null,null,null,null,null,{"$f":"'Budget Summary'!B61","v":"Single community bin lifter"},400000,0.2,1,1]
[null,null,null,null,null,null,null,null,null,null,null,{"$f":"'Budget Summary'!B62","v":"Twin community bin lifter"},700000,0.2,1,1]
[null,null,null,null,null,null,null,null,null,null,null,{"$f":"'Budget Summary'!B66","v":"Tractor Mounted Road Sweeper Vacuum Machine"},3100000,0.2,1,0]
[null,null,null,null,null,null,null,null,null,null,null,{"$f":"'Budget Summary'!B67","v":"Tractor Mounted Road Broomer Machine"},600000,0.2,1,0]
["Total Waste Generation from 1 HH having 5 members (Kgs)",{"$f":"0.45*5","v":2.25},"It is assumed that per capita waste is 450 grams",null,null,null,null,null,null,null,null,{"$f":"'Budget Summary'!B99","v":"Skid Steer Machine"},2200000,0.2,1,1]
[null,null,null,null,null,null,null,null,null,null,null,{"$f":"'Budget Summary'!B100","v":"Small Excavator"},2000000,0.2,1,0]
["Norms for waste generation (as per CPHEEO manual)",null,null,null,null,null,null,null,null,null,null,{"$f":"'Budget Summary'!B101","v":"Litter Picker (capacity around 2 Tonne)"},1000000,0.2,1,0]
["Population Range of ULB","Average Waste (grams/capita/day)",null,null,null,null,null,null,null,null,null,{"$f":"'Budget Summary'!B68","v":"Community Bins with capacity of 3 cu.mt."},40000,"-",0,0]
["Population range upto 1 lakh",210,null,null,null,null,null,null,null,null,null,{"$f":"'Budget Summary'!B69","v":"Community Bins with capacity of 4.5 cu.mt."},50000,"-",0,0]
["Population range 1 to 5 lakh",210,null,null,null,null,null,null,null,null,null,{"$f":"'Budget Summary'!B70","v":"Galvanized Trolley with capacity of 660 L"},27000,0.1,0,0]
["Population range 5 to 10 lakh",250,null,null,null,null,null,null,null,null,null,{"$f":"'Budget Summary'!B71","v":"Galvanized Trolley with capacity of 1100 L"},40000,0.1,0,0]
["Population range 10 to 20 lakh",270,null,null,null,null,null,null,null,null,null,"Litter bins in the commercial/market areas (Capacity in litre)",1200,"-",0,0]
[null,null,null,null,null,null,null,null,null,null,null,"Animal incinerator",3000000]
["Assumptions"]
["It is assumed that all equipments, vehicles and rolling stocks are procured by the ULB",null,null,null,null,null,null,null,null,null,null,"Equipment for street sweepers","Unit Rate\n(Amount in Rs.)"]
["Particulars","Requirement per year","Frequency per year",null,null,null,null,null,null,null,null,"Long handle broom",80]
["Long handle broom",4,"once in 3 months",null,null,null,null,null,null,null,null,"Metal Tray (Dust Pan)",50]
["Metal Tray (Dust Pan)",2,"once in 6 months",null,null,null,null,null,null,null,null,"Metal Plate",50]
["Metal Plate",2,"once in 6 months",null,null,null,null,null,null,null,null,"Ghamela (Tagaru)",100]
["Ghamela (Tagaru)",1,"once in a year",null,null,null,null,null,null,null,null,"Spades (Paavdo)",130]
["Spades (Paavdo)",1,"once in a year"]
["Uniform (Pair)",2,"once in 6 months",{"$f":"B35*M37","v":2000}]
["Gloves",4,"once in 3 months",200,null,null,null,null,null,null,null,"Health Safety Gears for Sanitation Workers","Unit Rate\n(Amount in Rs.)"]
["Gum Boots",1,"once in a year",230,null,null,null,null,null,null,null,"Uniform",1000]
["Safety Mask",4,"once in 3 months",80,null,null,null,null,null,null,null,"Gloves",50]
["Safety Jacket",1,"once in a year",100,null,null,null,null,null,null,null,"Gum Boots",230]
["Rain Coat",1,"once in a year",500,null,null,null,null,null,null,null,"Safety Mask",20]
[null,null,null,{"$f":"SUM(D35:D40)","v":3110},"Total cost of kit per person per year",null,null,null,null,null,null,"Safety Jacket",100]
[null,null,null,null,null,null,null,null,null,null,null,"Rain Coat",500]
["Year","Per capita waste generation"]
[1996,0.21,null,null,null,null,null,null,null,null,null,"Unit rate of Household Bins (10 ltr)",125]
[1997,{"$f":"B44+(B44*1.33%)","v":0.21279299999999998}]
[1998,{"$f":"B45+(B45*1.33%)","v":0.21562314689999998}]
[1999,0.21849093475376999]
[2000,0.22139686418599513]
[2001,0.22434144247966886]
[2002,0.22732518366464846]
[2003,0.23034860860738829]
[2004,0.23341224510186656]
[2005,0.23651662796172138]
[2006,0.23966229911361228]
[2007,0.24284980769182332]
[2008,0.24607971013412458]
[2009,0.24935257027890845]
[2010,0.25266895946361795]
[2011,0.25602945662448406]
[2012,0.25943464839758973]
{"$rows_left_out":45}
{"sheet":"Dropdown","index":5,"n_rows":15,"n_cols":4,"rows_kept":15,"cut":false,"hidden":true,"merged":[]}
[null,"Select option",null,"Select option"]
[null,"Yes",null,"ULB itself"]
[null,"No",null,"Private Agency"]
[null,"NA"]
[null,"Partially"]
[null,"Select option"]
[null,"Open Dump site"]
[null,"Scientific Landfill site"]
[null,"Processing / treatment site"]
[]
[null,"Area of the "," (in Acre)"]
[null,"Capacity of the "," (in MT)"]
[null,"Approx. distance of the "," (in km)"]
[]
[null," operated and maintained by"]